{"text_format":"1","workbook":"xlsx","n_sheets":2,"sheets":["Difference Contribution","Sheet1"],"not_rendered":{"charts":0,"images":0,"macros":1,"external_links":0,"defined_names":5,"comments":0,"pivot_tables":0},"unopened":[],"bounds":{"document_bytes":16777216,"sheet_cells":100000,"rows_first":2000,"rows_last":500,"rows_between":2000,"halvings":0,"cell_chars":16384,"cell_head_chars":4096},"cells_cut":0,"cells_raw":0,"read":"whole","date_system":"1900"}

{"sheet":"Difference Contribution","index":0,"n_rows":21,"n_cols":11,"rows_kept":21,"cut":false,"hidden":false,"merged":[[3,17,3,19]]}
[null,"Convert Excel To Text File"]
[]
[null,"Employee Code :","E1301002673K"]
[]
[null,"KSPA","Name","Date Of Birth","Month","Year (YYYY)","Salary","Socso Employer Share","Socso Employee Share","SKBBK","AGE"]
[null,"260500002242","MOLLA MD RIAD","2008-05-01",6,2026,15050.5,{"$f":"IF(DATE('Difference Contribution'!F6,'Difference Contribution'!E6,1)>DATE(2024,6,1),IF(data[[#This Row],[AGE]]<60,(VLOOKUP(data[[#This Row],[Salary]],Sheet1!A:H,2)),(VLOOKUP(data[[#This Row],[Salary]],Sheet1!A:H,6))),IF(DATE('Difference Contribution'!F6,'Difference Contribution'!E6,1)>DATE(2018,12,1),(VLOOKUP(data[[#This Row],[Salary]],Sheet1!A:H,6)),0))","v":104.15},{"$f":"IF(DATE('Difference Contribution'!F6,'Difference Contribution'!E6,1)>DATE(2024,6,1),IF(data[[#This Row],[AGE]]<60,(VLOOKUP(data[[#This Row],[Salary]],Sheet1!A:H,3)),(VLOOKUP(data[[#This Row],[Salary]],Sheet1!A:H,7))),IF(DATE('Difference Contribution'!F6,'Difference Contribution'!E6,1)>DATE(2018,12,1),(VLOOKUP(data[[#This Row],[Salary]],Sheet1!A:H,7)),0))","v":29.75},{"$f":"IF(DATE('Difference Contribution'!F6,'Difference Contribution'!E6,1)>DATE(2026,5,1),VLOOKUP(data[[#This Row],[Salary]],Sheet1!A:H,8),0)","v":44.65},{"$f":"DATEDIF(data[[#This Row],[Date Of Birth]], DATE('Difference Contribution'!F6,'Difference Contribution'!E6,1), \"Y\")","v":18}]
[null,"260500002254","PUI HAI","1970-04-01",3,2022,9000,{"$f":"IF(DATE('Difference Contribution'!F7,'Difference Contribution'!E7,1)>DATE(2024,6,1),IF(data[[#This Row],[AGE]]<60,(VLOOKUP(data[[#This Row],[Salary]],Sheet1!A:H,2)),(VLOOKUP(data[[#This Row],[Salary]],Sheet1!A:H,6))),IF(DATE('Difference Contribution'!F7,'Difference Contribution'!E7,1)>DATE(2018,12,1),(VLOOKUP(data[[#This Row],[Salary]],Sheet1!A:H,6)),0))","v":74.400000000000006},{"$f":"IF(DATE('Difference Contribution'!F7,'Difference Contribution'!E7,1)>DATE(2024,6,1),IF(data[[#This Row],[AGE]]<60,(VLOOKUP(data[[#This Row],[Salary]],Sheet1!A:H,3)),(VLOOKUP(data[[#This Row],[Salary]],Sheet1!A:H,7))),IF(DATE('Difference Contribution'!F7,'Difference Contribution'!E7,1)>DATE(2018,12,1),(VLOOKUP(data[[#This Row],[Salary]],Sheet1!A:H,7)),0))","v":0},{"$f":"IF(DATE('Difference Contribution'!F7,'Difference Contribution'!E7,1)>DATE(2026,5,1),VLOOKUP(data[[#This Row],[Salary]],Sheet1!A:H,8),0)","v":0},{"$f":"DATEDIF(data[[#This Row],[Date Of Birth]], DATE('Difference Contribution'!F7,'Difference Contribution'!E7,1), \"Y\")","v":51}]
[null,"260500002251","SIMON COWELL","2009-04-16",6,2026,1256,{"$f":"IF(DATE('Difference Contribution'!F8,'Difference Contribution'!E8,1)>DATE(2024,6,1),IF(data[[#This Row],[AGE]]<60,(VLOOKUP(data[[#This Row],[Salary]],Sheet1!A:H,2)),(VLOOKUP(data[[#This Row],[Salary]],Sheet1!A:H,6))),IF(DATE('Difference Contribution'!F8,'Difference Contribution'!E8,1)>DATE(2018,12,1),(VLOOKUP(data[[#This Row],[Salary]],Sheet1!A:H,6)),0))","v":21.85},{"$f":"IF(DATE('Difference Contribution'!F8,'Difference Contribution'!E8,1)>DATE(2024,6,1),IF(data[[#This Row],[AGE]]<60,(VLOOKUP(data[[#This Row],[Salary]],Sheet1!A:H,3)),(VLOOKUP(data[[#This Row],[Salary]],Sheet1!A:H,7))),IF(DATE('Difference Contribution'!F8,'Difference Contribution'!E8,1)>DATE(2018,12,1),(VLOOKUP(data[[#This Row],[Salary]],Sheet1!A:H,7)),0))","v":6.25},{"$f":"IF(DATE('Difference Contribution'!F8,'Difference Contribution'!E8,1)>DATE(2026,5,1),VLOOKUP(data[[#This Row],[Salary]],Sheet1!A:H,8),0)","v":9.35},{"$f":"DATEDIF(data[[#This Row],[Date Of Birth]], DATE('Difference Contribution'!F8,'Difference Contribution'!E8,1), \"Y\")","v":17}]
[null,"260500002246","TAEYANG","1964-12-02",4,2022,900,{"$f":"IF(DATE('Difference Contribution'!F9,'Difference Contribution'!E9,1)>DATE(2024,6,1),IF(data[[#This Row],[AGE]]<60,(VLOOKUP(data[[#This Row],[Salary]],Sheet1!A:H,2)),(VLOOKUP(data[[#This Row],[Salary]],Sheet1!A:H,6))),IF(DATE('Difference Contribution'!F9,'Difference Contribution'!E9,1)>DATE(2018,12,1),(VLOOKUP(data[[#This Row],[Salary]],Sheet1!A:H,6)),0))","v":10.6},{"$f":"IF(DATE('Difference Contribution'!F9,'Difference Contribution'!E9,1)>DATE(2024,6,1),IF(data[[#This Row],[AGE]]<60,(VLOOKUP(data[[#This Row],[Salary]],Sheet1!A:H,3)),(VLOOKUP(data[[#This Row],[Salary]],Sheet1!A:H,7))),IF(DATE('Difference Contribution'!F9,'Difference Contribution'!E9,1)>DATE(2018,12,1),(VLOOKUP(data[[#This Row],[Salary]],Sheet1!A:H,7)),0))","v":0},{"$f":"IF(DATE('Difference Contribution'!F9,'Difference Contribution'!E9,1)>DATE(2026,5,1),VLOOKUP(data[[#This Row],[Salary]],Sheet1!A:H,8),0)","v":0},{"$f":"DATEDIF(data[[#This Row],[Date Of Birth]], DATE('Difference Contribution'!F9,'Difference Contribution'!E9,1), \"Y\")","v":57}]
[null,"260500002716","SAMSUL KUDUS","1986-05-07",1,2018,300.89999999999998,{"$f":"IF(DATE('Difference Contribution'!F10,'Difference Contribution'!E10,1)>DATE(2024,6,1),IF(data[[#This Row],[AGE]]<60,(VLOOKUP(data[[#This Row],[Salary]],Sheet1!A:H,2)),(VLOOKUP(data[[#This Row],[Salary]],Sheet1!A:H,6))),IF(DATE('Difference Contribution'!F10,'Difference Contribution'!E10,1)>DATE(2018,12,1),(VLOOKUP(data[[#This Row],[Salary]],Sheet1!A:H,6)),0))","v":0},{"$f":"IF(DATE('Difference Contribution'!F10,'Difference Contribution'!E10,1)>DATE(2024,6,1),IF(data[[#This Row],[AGE]]<60,(VLOOKUP(data[[#This Row],[Salary]],Sheet1!A:H,3)),(VLOOKUP(data[[#This Row],[Salary]],Sheet1!A:H,7))),IF(DATE('Difference Contribution'!F10,'Difference Contribution'!E10,1)>DATE(2018,12,1),(VLOOKUP(data[[#This Row],[Salary]],Sheet1!A:H,7)),0))","v":0},{"$f":"IF(DATE('Difference Contribution'!F10,'Difference Contribution'!E10,1)>DATE(2026,5,1),VLOOKUP(data[[#This Row],[Salary]],Sheet1!A:H,8),0)","v":0},{"$f":"DATEDIF(data[[#This Row],[Date Of Birth]], DATE('Difference Contribution'!F10,'Difference Contribution'!E10,1), \"Y\")","v":31}]
[null,202504058972,"JENALYN LENIHAN TINAE","1984-05-22",6,2026,3565,{"$f":"IF(DATE('Difference Contribution'!F11,'Difference Contribution'!E11,1)>DATE(2024,6,1),IF(data[[#This Row],[AGE]]<60,(VLOOKUP(data[[#This Row],[Salary]],Sheet1!A:H,2)),(VLOOKUP(data[[#This Row],[Salary]],Sheet1!A:H,6))),IF(DATE('Difference Contribution'!F11,'Difference Contribution'!E11,1)>DATE(2018,12,1),(VLOOKUP(data[[#This Row],[Salary]],Sheet1!A:H,6)),0))","v":62.15},{"$f":"IF(DATE('Difference Contribution'!F11,'Difference Contribution'!E11,1)>DATE(2024,6,1),IF(data[[#This Row],[AGE]]<60,(VLOOKUP(data[[#This Row],[Salary]],Sheet1!A:H,3)),(VLOOKUP(data[[#This Row],[Salary]],Sheet1!A:H,7))),IF(DATE('Difference Contribution'!F11,'Difference Contribution'!E11,1)>DATE(2018,12,1),(VLOOKUP(data[[#This Row],[Salary]],Sheet1!A:H,7)),0))","v":17.75},{"$f":"IF(DATE('Difference Contribution'!F11,'Difference Contribution'!E11,1)>DATE(2026,5,1),VLOOKUP(data[[#This Row],[Salary]],Sheet1!A:H,8),0)","v":26.65},{"$f":"DATEDIF(data[[#This Row],[Date Of Birth]], DATE('Difference Contribution'!F11,'Difference Contribution'!E11,1), \"Y\")","v":42}]
[null,202101853272,"WAHIB MOHAMMED MOHSEN","1970-05-19",6,2022,90,{"$f":"IF(DATE('Difference Contribution'!F12,'Difference Contribution'!E12,1)>DATE(2024,6,1),IF(data[[#This Row],[AGE]]<60,(VLOOKUP(data[[#This Row],[Salary]],Sheet1!A:H,2)),(VLOOKUP(data[[#This Row],[Salary]],Sheet1!A:H,6))),IF(DATE('Difference Contribution'!F12,'Difference Contribution'!E12,1)>DATE(2018,12,1),(VLOOKUP(data[[#This Row],[Salary]],Sheet1!A:H,6)),0))","v":1.1000000000000001},{"$f":"IF(DATE('Difference Contribution'!F12,'Difference Contribution'!E12,1)>DATE(2024,6,1),IF(data[[#This Row],[AGE]]<60,(VLOOKUP(data[[#This Row],[Salary]],Sheet1!A:H,3)),(VLOOKUP(data[[#This Row],[Salary]],Sheet1!A:H,7))),IF(DATE('Difference Contribution'!F12,'Difference Contribution'!E12,1)>DATE(2018,12,1),(VLOOKUP(data[[#This Row],[Salary]],Sheet1!A:H,7)),0))","v":0},{"$f":"IF(DATE('Difference Contribution'!F12,'Difference Contribution'!E12,1)>DATE(2026,5,1),VLOOKUP(data[[#This Row],[Salary]],Sheet1!A:H,8),0)","v":0},{"$f":"DATEDIF(data[[#This Row],[Date Of Birth]], DATE('Difference Contribution'!F12,'Difference Contribution'!E12,1), \"Y\")","v":52}]
[null,202604201972,"MOHAMED IBRAHIM","1979-03-28",6,2022,4500,{"$f":"IF(DATE('Difference Contribution'!F13,'Difference Contribution'!E13,1)>DATE(2024,6,1),IF(data[[#This Row],[AGE]]<60,(VLOOKUP(data[[#This Row],[Salary]],Sheet1!A:H,2)),(VLOOKUP(data[[#This Row],[Salary]],Sheet1!A:H,6))),IF(DATE('Difference Contribution'!F13,'Difference Contribution'!E13,1)>DATE(2018,12,1),(VLOOKUP(data[[#This Row],[Salary]],Sheet1!A:H,6)),0))","v":55.6},{"$f":"IF(DATE('Difference Contribution'!F13,'Difference Contribution'!E13,1)>DATE(2024,6,1),IF(data[[#This Row],[AGE]]<60,(VLOOKUP(data[[#This Row],[Salary]],Sheet1!A:H,3)),(VLOOKUP(data[[#This Row],[Salary]],Sheet1!A:H,7))),IF(DATE('Difference Contribution'!F13,'Difference Contribution'!E13,1)>DATE(2018,12,1),(VLOOKUP(data[[#This Row],[Salary]],Sheet1!A:H,7)),0))","v":0},{"$f":"IF(DATE('Difference Contribution'!F13,'Difference Contribution'!E13,1)>DATE(2026,5,1),VLOOKUP(data[[#This Row],[Salary]],Sheet1!A:H,8),0)","v":0},{"$f":"DATEDIF(data[[#This Row],[Date Of Birth]], DATE('Difference Contribution'!F13,'Difference Contribution'!E13,1), \"Y\")","v":43}]
[null,"260500002242","MOLLA MD RIAD","2008-05-01",7,2022,0.9,{"$f":"IF(DATE('Difference Contribution'!F14,'Difference Contribution'!E14,1)>DATE(2024,6,1),IF(data[[#This Row],[AGE]]<60,(VLOOKUP(data[[#This Row],[Salary]],Sheet1!A:H,2)),(VLOOKUP(data[[#This Row],[Salary]],Sheet1!A:H,6))),IF(DATE('Difference Contribution'!F14,'Difference Contribution'!E14,1)>DATE(2018,12,1),(VLOOKUP(data[[#This Row],[Salary]],Sheet1!A:H,6)),0))","v":0.3},{"$f":"IF(DATE('Difference Contribution'!F14,'Difference Contribution'!E14,1)>DATE(2024,6,1),IF(data[[#This Row],[AGE]]<60,(VLOOKUP(data[[#This Row],[Salary]],Sheet1!A:H,3)),(VLOOKUP(data[[#This Row],[Salary]],Sheet1!A:H,7))),IF(DATE('Difference Contribution'!F14,'Difference Contribution'!E14,1)>DATE(2018,12,1),(VLOOKUP(data[[#This Row],[Salary]],Sheet1!A:H,7)),0))","v":0},{"$f":"IF(DATE('Difference Contribution'!F14,'Difference Contribution'!E14,1)>DATE(2026,5,1),VLOOKUP(data[[#This Row],[Salary]],Sheet1!A:H,8),0)","v":0},{"$f":"DATEDIF(data[[#This Row],[Date Of Birth]], DATE('Difference Contribution'!F14,'Difference Contribution'!E14,1), \"Y\")","v":14}]
[null,"260500002254","PUI HAI","1970-04-01",7,2022,11000,{"$f":"IF(DATE('Difference Contribution'!F15,'Difference Contribution'!E15,1)>DATE(2024,6,1),IF(data[[#This Row],[AGE]]<60,(VLOOKUP(data[[#This Row],[Salary]],Sheet1!A:H,2)),(VLOOKUP(data[[#This Row],[Salary]],Sheet1!A:H,6))),IF(DATE('Difference Contribution'!F15,'Difference Contribution'!E15,1)>DATE(2018,12,1),(VLOOKUP(data[[#This Row],[Salary]],Sheet1!A:H,6)),0))","v":74.400000000000006},{"$f":"IF(DATE('Difference Contribution'!F15,'Difference Contribution'!E15,1)>DATE(2024,6,1),IF(data[[#This Row],[AGE]]<60,(VLOOKUP(data[[#This Row],[Salary]],Sheet1!A:H,3)),(VLOOKUP(data[[#This Row],[Salary]],Sheet1!A:H,7))),IF(DATE('Difference Contribution'!F15,'Difference Contribution'!E15,1)>DATE(2018,12,1),(VLOOKUP(data[[#This Row],[Salary]],Sheet1!A:H,7)),0))","v":0},{"$f":"IF(DATE('Difference Contribution'!F15,'Difference Contribution'!E15,1)>DATE(2026,5,1),VLOOKUP(data[[#This Row],[Salary]],Sheet1!A:H,8),0)","v":0},{"$f":"DATEDIF(data[[#This Row],[Date Of Birth]], DATE('Difference Contribution'!F15,'Difference Contribution'!E15,1), \"Y\")","v":52}]
[null,"260500002251","SIMON COWELL","2009-04-16",12,"2022",20599,{"$f":"IF(DATE('Difference Contribution'!F16,'Difference Contribution'!E16,1)>DATE(2024,6,1),IF(data[[#This Row],[AGE]]<60,(VLOOKUP(data[[#This Row],[Salary]],Sheet1!A:H,2)),(VLOOKUP(data[[#This Row],[Salary]],Sheet1!A:H,6))),IF(DATE('Difference Contribution'!F16,'Difference Contribution'!E16,1)>DATE(2018,12,1),(VLOOKUP(data[[#This Row],[Salary]],Sheet1!A:H,6)),0))","v":74.400000000000006},{"$f":"IF(DATE('Difference Contribution'!F16,'Difference Contribution'!E16,1)>DATE(2024,6,1),IF(data[[#This Row],[AGE]]<60,(VLOOKUP(data[[#This Row],[Salary]],Sheet1!A:H,3)),(VLOOKUP(data[[#This Row],[Salary]],Sheet1!A:H,7))),IF(DATE('Difference Contribution'!F16,'Difference Contribution'!E16,1)>DATE(2018,12,1),(VLOOKUP(data[[#This Row],[Salary]],Sheet1!A:H,7)),0))","v":0},{"$f":"IF(DATE('Difference Contribution'!F16,'Difference Contribution'!E16,1)>DATE(2026,5,1),VLOOKUP(data[[#This Row],[Salary]],Sheet1!A:H,8),0)","v":0},{"$f":"DATEDIF(data[[#This Row],[Date Of Birth]], DATE('Difference Contribution'!F16,'Difference Contribution'!E16,1), \"Y\")","v":13}]
[null,"260500002246","TAEYANG","1964-12-02",1,"2025",5500,{"$f":"IF(DATE('Difference Contribution'!F17,'Difference Contribution'!E17,1)>DATE(2024,6,1),IF(data[[#This Row],[AGE]]<60,(VLOOKUP(data[[#This Row],[Salary]],Sheet1!A:H,2)),(VLOOKUP(data[[#This Row],[Salary]],Sheet1!A:H,6))),IF(DATE('Difference Contribution'!F17,'Difference Contribution'!E17,1)>DATE(2018,12,1),(VLOOKUP(data[[#This Row],[Salary]],Sheet1!A:H,6)),0))","v":68.099999999999994},{"$f":"IF(DATE('Difference Contribution'!F17,'Difference Contribution'!E17,1)>DATE(2024,6,1),IF(data[[#This Row],[AGE]]<60,(VLOOKUP(data[[#This Row],[Salary]],Sheet1!A:H,3)),(VLOOKUP(data[[#This Row],[Salary]],Sheet1!A:H,7))),IF(DATE('Difference Contribution'!F17,'Difference Contribution'!E17,1)>DATE(2018,12,1),(VLOOKUP(data[[#This Row],[Salary]],Sheet1!A:H,7)),0))","v":0},{"$f":"IF(DATE('Difference Contribution'!F17,'Difference Contribution'!E17,1)>DATE(2026,5,1),VLOOKUP(data[[#This Row],[Salary]],Sheet1!A:H,8),0)","v":0},{"$f":"DATEDIF(data[[#This Row],[Date Of Birth]], DATE('Difference Contribution'!F17,'Difference Contribution'!E17,1), \"Y\")","v":60}]
[null,"260500002716","SAMSUL KUDUS","1986-05-07",11,"2015",1000,{"$f":"IF(DATE('Difference Contribution'!F18,'Difference Contribution'!E18,1)>DATE(2024,6,1),IF(data[[#This Row],[AGE]]<60,(VLOOKUP(data[[#This Row],[Salary]],Sheet1!A:H,2)),(VLOOKUP(data[[#This Row],[Salary]],Sheet1!A:H,6))),IF(DATE('Difference Contribution'!F18,'Difference Contribution'!E18,1)>DATE(2018,12,1),(VLOOKUP(data[[#This Row],[Salary]],Sheet1!A:H,6)),0))","v":0},{"$f":"IF(DATE('Difference Contribution'!F18,'Difference Contribution'!E18,1)>DATE(2024,6,1),IF(data[[#This Row],[AGE]]<60,(VLOOKUP(data[[#This Row],[Salary]],Sheet1!A:H,3)),(VLOOKUP(data[[#This Row],[Salary]],Sheet1!A:H,7))),IF(DATE('Difference Contribution'!F18,'Difference Contribution'!E18,1)>DATE(2018,12,1),(VLOOKUP(data[[#This Row],[Salary]],Sheet1!A:H,7)),0))","v":0},{"$f":"IF(DATE('Difference Contribution'!F18,'Difference Contribution'!E18,1)>DATE(2026,5,1),VLOOKUP(data[[#This Row],[Salary]],Sheet1!A:H,8),0)","v":0},{"$f":"DATEDIF(data[[#This Row],[Date Of Birth]], DATE('Difference Contribution'!F18,'Difference Contribution'!E18,1), \"Y\")","v":29}]
[null,202504058972,"JENALYN LENIHAN TINAE","1984-05-22",2,"2025",4500,{"$f":"IF(DATE('Difference Contribution'!F19,'Difference Contribution'!E19,1)>DATE(2024,6,1),IF(data[[#This Row],[AGE]]<60,(VLOOKUP(data[[#This Row],[Salary]],Sheet1!A:H,2)),(VLOOKUP(data[[#This Row],[Salary]],Sheet1!A:H,6))),IF(DATE('Difference Contribution'!F19,'Difference Contribution'!E19,1)>DATE(2018,12,1),(VLOOKUP(data[[#This Row],[Salary]],Sheet1!A:H,6)),0))","v":77.849999999999994},{"$f":"IF(DATE('Difference Contribution'!F19,'Difference Contribution'!E19,1)>DATE(2024,6,1),IF(data[[#This Row],[AGE]]<60,(VLOOKUP(data[[#This Row],[Salary]],Sheet1!A:H,3)),(VLOOKUP(data[[#This Row],[Salary]],Sheet1!A:H,7))),IF(DATE('Difference Contribution'!F19,'Difference Contribution'!E19,1)>DATE(2018,12,1),(VLOOKUP(data[[#This Row],[Salary]],Sheet1!A:H,7)),0))","v":22.25},{"$f":"IF(DATE('Difference Contribution'!F19,'Difference Contribution'!E19,1)>DATE(2026,5,1),VLOOKUP(data[[#This Row],[Salary]],Sheet1!A:H,8),0)","v":0},{"$f":"DATEDIF(data[[#This Row],[Date Of Birth]], DATE('Difference Contribution'!F19,'Difference Contribution'!E19,1), \"Y\")","v":40}]
[null,202101853272,"WAHIB MOHAMMED MOHSEN","1970-05-19",5,"2026",3325,{"$f":"IF(DATE('Difference Contribution'!F20,'Difference Contribution'!E20,1)>DATE(2024,6,1),IF(data[[#This Row],[AGE]]<60,(VLOOKUP(data[[#This Row],[Salary]],Sheet1!A:H,2)),(VLOOKUP(data[[#This Row],[Salary]],Sheet1!A:H,6))),IF(DATE('Difference Contribution'!F20,'Difference Contribution'!E20,1)>DATE(2018,12,1),(VLOOKUP(data[[#This Row],[Salary]],Sheet1!A:H,6)),0))","v":58.65},{"$f":"IF(DATE('Difference Contribution'!F20,'Difference Contribution'!E20,1)>DATE(2024,6,1),IF(data[[#This Row],[AGE]]<60,(VLOOKUP(data[[#This Row],[Salary]],Sheet1!A:H,3)),(VLOOKUP(data[[#This Row],[Salary]],Sheet1!A:H,7))),IF(DATE('Difference Contribution'!F20,'Difference Contribution'!E20,1)>DATE(2018,12,1),(VLOOKUP(data[[#This Row],[Salary]],Sheet1!A:H,7)),0))","v":16.75},{"$f":"IF(DATE('Difference Contribution'!F20,'Difference Contribution'!E20,1)>DATE(2026,5,1),VLOOKUP(data[[#This Row],[Salary]],Sheet1!A:H,8),0)","v":0},{"$f":"DATEDIF(data[[#This Row],[Date Of Birth]], DATE('Difference Contribution'!F20,'Difference Contribution'!E20,1), \"Y\")","v":55}]
[null,202604201972,"MOHAMED IBRAHIM","1979-03-28",4,"2022",8567,{"$f":"IF(DATE('Difference Contribution'!F21,'Difference Contribution'!E21,1)>DATE(2024,6,1),IF(data[[#This Row],[AGE]]<60,(VLOOKUP(data[[#This Row],[Salary]],Sheet1!A:H,2)),(VLOOKUP(data[[#This Row],[Salary]],Sheet1!A:H,6))),IF(DATE('Difference Contribution'!F21,'Difference Contribution'!E21,1)>DATE(2018,12,1),(VLOOKUP(data[[#This Row],[Salary]],Sheet1!A:H,6)),0))","v":74.400000000000006},{"$f":"IF(DATE('Difference Contribution'!F21,'Difference Contribution'!E21,1)>DATE(2024,6,1),IF(data[[#This Row],[AGE]]<60,(VLOOKUP(data[[#This Row],[Salary]],Sheet1!A:H,3)),(VLOOKUP(data[[#This Row],[Salary]],Sheet1!A:H,7))),IF(DATE('Difference Contribution'!F21,'Difference Contribution'!E21,1)>DATE(2018,12,1),(VLOOKUP(data[[#This Row],[Salary]],Sheet1!A:H,7)),0))","v":0},{"$f":"IF(DATE('Difference Contribution'!F21,'Difference Contribution'!E21,1)>DATE(2026,5,1),VLOOKUP(data[[#This Row],[Salary]],Sheet1!A:H,8),0)","v":0},{"$f":"DATEDIF(data[[#This Row],[Date Of Birth]], DATE('Difference Contribution'!F21,'Difference Contribution'!E21,1), \"Y\")","v":43}]

{"sheet":"Sheet1","index":1,"n_rows":66,"n_cols":8,"rows_kept":66,"cut":false,"hidden":true,"merged":[]}
["Salary","Socso Employer Share (J1)","Socso Employee Share (J1)","EIS Employer Share (J1)","EIS Employee Share (J1)","Socso Employer Share (J2)","Socso Employee Share (J2)","SKBBK"]
[0,0.4,0.1,0.05,0.05,0.3,0,0.2]
[30.01,0.7,0.2,0.1,0.1,0.5,0,0.3]
[50.01,1.1000000000000001,0.3,0.15,0.15,0.8,0,0.5]
[70.010000000000005,1.5,0.4,0.2,0.2,1.1000000000000001,0,0.65]
[100.01,2.1,0.6,0.25,0.25,1.5,0,0.9]
[140.01,2.95,0.85,0.35,0.35,2.1,0,1.25]
[200.01,4.3499999999999996,1.25,0.5,0.5,3.1,0,1.85]
[300.01,6.15,1.75,0.7,0.7,4.4000000000000004,0,2.65]
[400.01,7.85,2.25,0.9,0.9,5.6,0,3.35]
[500.01,9.65,2.75,1.1000000000000001,1.1000000000000001,6.9,0,4.1500000000000004]
[600.01,11.35,3.25,1.3,1.3,8.1,0,4.8499999999999996]
[700.01,13.15,3.75,1.5,1.5,9.4,0,5.65]
[800.01,14.85,4.25,1.7,1.7,10.6,0,6.35]
[900.01,16.649999999999999,4.75,1.9,1.9,11.9,0,7.15]
[1000.01,18.350000000000001,5.25,2.1,2.1,13.1,0,7.85]
[1100.01,20.149999999999999,5.75,2.2999999999999998,2.2999999999999998,14.4,0,8.65]
[1200.01,21.85,6.25,2.5,2.5,15.6,0,9.35]
[1300.01,23.65,6.75,2.7,2.7,16.899999999999999,0,10.15]
[1400.01,25.35,7.25,2.9,2.9,18.100000000000001,0,10.85]
[1500.01,27.15,7.75,3.1,3.1,19.399999999999999,0,11.65]
[1600.01,28.85,8.25,3.3,3.3,20.6,0,12.35]
[1700.01,30.65,8.75,3.5,3.5,21.9,0,13.15]
[1800.01,32.35,9.25,3.7,3.7,23.1,0,13.85]
[1900.01,34.15,9.75,3.9,3.9,24.4,0,14.65]
[2000.01,35.85,10.25,4.0999999999999996,4.0999999999999996,25.6,0,15.35]
[2100.0100000000002,37.65,10.75,4.3,4.3,26.9,0,16.149999999999999]
[2200.0100000000002,39.35,11.25,4.5,4.5,28.1,0,16.850000000000001]
[2300.0100000000002,41.15,11.75,4.7,4.7,29.4,0,17.649999999999999]
[2400.0100000000002,42.85,12.25,4.9000000000000004,4.9000000000000004,30.6,0,18.350000000000001]
[2500.0100000000002,44.65,12.75,5.0999999999999996,5.0999999999999996,31.9,0,19.149999999999999]
[2600.0100000000002,46.35,13.25,5.3,5.3,33.1,0,19.850000000000001]
[2700.01,48.15,13.75,5.5,5.5,34.4,0,20.65]
[2800.01,49.85,14.25,5.7,5.7,35.6,0,21.35]
[2900.01,51.65,14.75,5.9,5.9,36.9,0,22.15]
[3000.01,53.35,15.25,6.1,6.1,38.1,0,22.85]
[3100.01,55.15,15.75,6.3,6.3,39.4,0,23.65]
[3200.01,56.85,16.25,6.5,6.5,40.6,0,24.35]
[3300.01,58.65,16.75,6.7,6.7,41.9,0,25.15]
[3400.01,60.35,17.25,6.9,6.9,43.1,0,25.85]
[3500.01,62.15,17.75,7.1,7.1,44.4,0,26.65]
[3600.01,63.85,18.25,7.3,7.3,45.6,0,27.35]
[3700.01,65.650000000000006,18.75,7.5,7.5,46.9,0,28.15]
[3800.01,67.349999999999994,19.25,7.7,7.7,48.1,0,28.85]
[3900.01,69.150000000000006,19.75,7.9,7.9,49.4,0,29.65]
[4000.01,70.849999999999994,20.25,8.1,8.1,50.6,0,30.35]
[4100.01,72.650000000000006,20.75,8.3000000000000007,8.3000000000000007,51.9,0,31.15]
[4200.01,74.349999999999994,21.25,8.5,8.5,53.1,0,31.85]
[4300.01,76.150000000000006,21.75,8.6999999999999993,8.6999999999999993,54.4,0,32.65]
[4400.01,77.849999999999994,22.25,8.9,8.9,55.6,0,33.35]
[4500.01,79.650000000000006,22.75,9.1,9.1,56.9,0,34.15]
[4600.01,81.349999999999994,23.25,9.3000000000000007,9.3000000000000007,58.1,0,34.85]
[4700.01,83.15,23.75,9.5,9.5,59.4,0,35.65]
[4800.01,84.85,24.25,9.6999999999999993,9.6999999999999993,60.6,0,36.35]
[4900.01,86.65,24.75,9.9,9.9,61.9,0,37.15]
[5000.01,88.35,25.25,10.1,10.1,63.4,0,37.85]
[5100.01,90.15,25.75,10.3,10.3,64.400000000000006,0,38.65]
[5200.01,91.85,26.25,10.5,10.5,65.599999999999994,0,39.35]
[5300.01,93.65,26.75,10.7,10.7,66.900000000000006,0,40.15]
[5400.01,95.35,27.25,10.9,10.9,68.099999999999994,0,40.85]
[5500.01,97.15,27.75,11.1,11.1,69.400000000000006,0,41.65]
[5600.01,98.85,28.25,11.3,11.3,70.599999999999994,0,42.35]
[5700.01,100.65,28.75,11.5,11.5,71.900000000000006,0,43.15]
[5800.01,102.35,29.25,11.7,11.7,73.099999999999994,0,43.85]
[5900.01,104.15,29.75,11.9,11.9,74.400000000000006,0,44.65]
[6000.01,104.15,29.75,11.9,11.9,74.400000000000006,0,44.65]