{"text_format":"1","workbook":"xlsx","n_sheets":2,"sheets":["Difference Contribution","Sheet1"],"not_rendered":{"charts":0,"images":0,"macros":1,"external_links":0,"defined_names":1,"comments":0,"pivot_tables":0},"unopened":[],"bounds":{"document_bytes":16777216,"sheet_cells":100000,"rows_first":2000,"rows_last":500,"rows_between":2000,"halvings":0,"cell_chars":16384,"cell_head_chars":4096},"cells_cut":0,"cells_raw":0,"read":"whole","date_system":"1900"}

{"sheet":"Difference Contribution","index":0,"n_rows":6,"n_cols":10,"rows_kept":6,"cut":false,"hidden":false,"merged":[[3,16,3,18]]}
[null,"Convert Excel To Text File"]
[]
[null,"Employee Code :","E13010026XXK"]
[]
[null,"New IC Number","Name","Month","Year (YYYY)","Salary","Socso Employer Share","Socso Employee Share","EIS Employer Share","EIS Employee Share"]
[null,"760909016XXX","ALI BIN ABU",3,2022,2000,{"$f":"VLOOKUP(data[[#This Row],[Salary]],Sheet1!$A$2:$E$56,2)","v":34.15},{"$f":"VLOOKUP(data[[#This Row],[Salary]],Sheet1!$A$2:$E$56,3)","v":9.75},{"$f":"VLOOKUP(data[[#This Row],[Salary]],Sheet1!$A$2:$E$56,4)","v":3.9},{"$f":"VLOOKUP(data[[#This Row],[Salary]],Sheet1!$A$2:$E$56,5)","v":3.9}]

{"sheet":"Sheet1","index":1,"n_rows":56,"n_cols":5,"rows_kept":56,"cut":false,"hidden":false,"merged":[]}
["Salary","Socso Employer Share","Socso Employee Share","EIS Employer Share","EIS Employee Share"]
[0,0.4,0.1,0.05,0.05]
[30.01,0.7,0.2,0.1,0.1]
[50.01,1.1000000000000001,0.3,0.15,0.15]
[70.010000000000005,1.5,0.4,0.2,0.2]
[100.01,2.1,0.6,0.25,0.25]
[140.01,2.95,0.85,0.35,0.35]
[200.01,4.3499999999999996,1.25,0.5,0.5]
[300.01,6.15,1.75,0.7,0.7]
[400.01,7.85,2.25,0.9,0.9]
[500.01,9.65,2.75,1.1000000000000001,1.1000000000000001]
[600.01,11.35,3.25,1.3,1.3]
[700.01,13.15,3.75,1.5,1.5]
[800.01,14.85,4.25,1.7,1.7]
[900.01,16.649999999999999,4.75,1.9,1.9]
[1000.01,18.350000000000001,5.25,2.1,2.1]
[1100.01,20.149999999999999,5.75,2.2999999999999998,2.2999999999999998]
[1200.01,21.85,6.25,2.5,2.5]
[1300.01,23.65,6.75,2.7,2.7]
[1400.01,25.35,7.25,2.9,2.9]
[1500.01,27.15,7.75,3.1,3.1]
[1600.01,28.85,8.25,3.3,3.3]
[1700.01,30.65,8.75,3.5,3.5]
[1800.01,32.35,9.25,3.7,3.7]
[1900.01,34.15,9.75,3.9,3.9]
[2000.01,35.85,10.25,4.0999999999999996,4.0999999999999996]
[2100.0100000000002,37.65,10.75,4.3,4.3]
[2200.0100000000002,39.35,11.25,4.5,4.5]
[2300.0100000000002,41.15,11.75,4.7,4.7]
[2400.0100000000002,42.85,12.25,4.9000000000000004,4.9000000000000004]
[2500.0100000000002,44.65,12.75,5.0999999999999996,5.0999999999999996]
[2600.0100000000002,46.35,13.25,5.3,5.3]
[2700.01,48.15,13.75,5.5,5.5]
[2800.01,49.85,14.25,5.7,5.7]
[2900.01,51.65,14.75,5.9,5.9]
[3000.01,53.35,15.25,6.1,6.1]
[3100.01,55.15,15.75,6.3,6.3]
[3200.01,56.85,16.25,6.5,6.5]
[3300.01,58.65,16.75,6.7,6.7]
[3400.01,60.35,17.25,6.9,6.9]
[3500.01,62.15,17.75,7.1,7.1]
[3600.01,63.85,18.25,7.3,7.3]
[3700.01,65.650000000000006,18.75,7.5,7.5]
[3800.01,67.349999999999994,19.25,7.7,7.7]
[3900.01,69.150000000000006,19.75,7.9,7.9]
[4000.01,70.849999999999994,20.25,8.1,8.1]
[4100.01,72.650000000000006,20.75,8.3000000000000007,8.3000000000000007]
[4200.01,74.349999999999994,21.25,8.5,8.5]
[4300.01,76.150000000000006,21.75,8.6999999999999993,8.6999999999999993]
[4400.01,77.849999999999994,22.25,8.9,8.9]
[4500.01,79.650000000000006,22.75,9.1,9.1]
[4600.01,81.349999999999994,23.25,9.3000000000000007,9.3000000000000007]
[4700.01,83.15,23.75,9.5,9.5]
[4800.01,84.85,24.25,9.6999999999999993,9.6999999999999993]
[4900.01,86.65,24.75,9.9,9.9]
[5000.01,86.65,24.75,9.9,9.9]